{"text_format":"1","workbook":"xlsx","n_sheets":5,"sheets":["交付申請書","事業実施計画書","申請概要","リスト","医療機関コードマスタ"],"not_rendered":{"charts":0,"images":0,"macros":1,"external_links":1,"defined_names":93,"comments":1,"pivot_tables":0},"unopened":[],"bounds":{"document_bytes":16777216,"sheet_cells":100000,"rows_first":2000,"rows_last":500,"rows_between":2000,"halvings":0,"cell_chars":16384,"cell_head_chars":4096},"cells_cut":0,"cells_raw":0,"read":"whole","date_system":"1900"}

{"sheet":"交付申請書","index":0,"n_rows":33,"n_cols":9,"rows_kept":33,"cut":false,"hidden":false,"merged":[[32,0,32,8],[16,0,17,8],[24,0,24,8],[3,7,3,8],[22,3,22,6],[26,0,26,8],[28,0,28,8],[30,0,30,8]]}
["様式1"]
[]
[]
[null,null,null,null,null,null,null,{"$f":"IF(事業実施計画書!D6=0,\"申請日（自動表示）\",事業実施計画書!D6)","v":"申請日（自動表示）"}]
[]
[]
[{"$f":"IF(事業実施計画書!L21=\"\",\"知事名（自動表示）　殿\",事業実施計画書!L21&\"知事　殿\")","v":"知事名（自動表示）　殿"}]
[]
[]
[null,null,null,null,null,null,null,null,{"$f":"事業実施計画書!L21&事業実施計画書!P21","v":""}]
[null,null,null,null,null,null,null,null,{"$f":"事業実施計画書!Q11","v":"医療機関コード、１０桁を入力すると、自動表示されます。"}]
[null,null,null,null,null,null,null,null,{"$f":"事業実施計画書!D14&\"　\"&事業実施計画書!M14","v":"　"}]
[]
[]
[]
[]
["令和２年度新型コロナウイルス感染症緊急包括支援交付金（医療機関・薬局等における感染拡大防止等支援事業）の交付申請書兼交付請求書"]
[]
[]
["　標記について、次により交付金を交付されるよう関係書類を添えて申請する。"]
[]
[]
["１　申請額・請求額",null,null,{"$f":"IF(事業実施計画書!R70=0,\"金（申請額 自動表示）円\",事業実施計画書!R70)","v":"金（申請額 自動表示）円"}]
[]
["２　新型コロナウイルス感染症緊急包括支援交付金（医療機関・薬局等における感染拡大防止等支援事業）に関する事業実施計画書"]
[]
["３　事業の目的、内容及び効果　新型コロナウイルス感染症に対応した感染拡大防止対策・診療体制等の確保等"]
[]
["４　経費の使用方法　新型コロナウイルス感染症に対応した感染拡大防止対策・診療体制等の確保等に要する費用に用いる"]
[]
["５　事業の完了予定期日　令和３年３月３１日"]
[]
["６　「佐賀県医療機関・薬局等における感染拡大防止等支援事業費補助金交付要綱」第３条第２項各号及び第３項に該当しない"]

{"sheet":"事業実施計画書","index":1,"n_rows":111,"n_cols":28,"rows_kept":111,"cut":false,"hidden":false,"merged":[[3,0,3,29],[7,0,7,29],[10,0,11,2],[10,3,11,3],[10,4,11,4],[10,5,11,5],[10,10,11,10],[10,11,11,11],[10,12,11,12],[10,13,11,15],[10,16,11,29],[5,7,5,15],[10,6,11,6],[10,7,11,7],[10,8,11,8],[10,9,11,9],[16,18,16,29],[17,3,17,7],[17,8,17,12],[17,13,17,17],[17,18,17,29],[71,2,71,15],[71,16,71,17],[71,18,71,27],[48,20,48,21],[46,0,46,29],[67,21,67,24],[64,6,64,16],[61,6,61,16],[62,6,62,16],[65,6,65,16],[63,6,63,16],[60,6,60,16],[67,6,67,16],[61,17,61,20],[62,17,62,20],[57,17,57,20],[58,17,58,20],[59,17,59,20],[60,17,60,20],[69,4,69,16],[57,4,66,5],[66,6,66,16],[19,0,20,2],[25,14,25,29],[22,12,22,14],[22,15,22,18],[22,19,22,23],[22,0,22,5],[22,6,22,11],[25,0,25,11],[25,12,25,13],[23,6,23,11],[22,24,22,29],[36,14,37,14],[36,15,37,15],[36,16,37,16],[36,17,37,19],[40,0,40,6],[40,7,40,29],[41,0,42,6],[68,17,68,24],[36,0,37,2],[33,0,33,13],[67,4,67,5],[63,17,63,20],[64,17,64,20],[57,21,66,24],[65,17,65,20],[67,17,67,20],[57,6,57,16],[58,6,58,16],[59,6,59,16],[66,17,66,20],[56,17,56,20],[50,2,50,25],[54,1,54,28],[36,3,37,9],[36,10,37,12],[36,20,37,23],[36,24,37,26],[36,27,37,27],[36,28,37,28],[36,13,37,13],[13,3,14,8],[35,0,35,29],[20,11,20,14],[68,4,68,16],[73,1,73,28],[5,0,5,2],[5,3,5,6],[44,0,44,29],[31,14,31,15],[31,0,31,13],[31,16,31,29],[19,15,19,26],[20,15,20,26],[16,0,17,2],[16,3,16,7],[16,8,16,12],[16,13,16,17],[13,0,14,2],[13,9,14,11],[29,12,29,13],[48,0,48,19],[48,22,48,29],[56,21,56,24],[56,4,56,16],[19,11,19,14],[33,14,33,15],[19,3,19,10],[69,17,69,24],[0,27,0,29],[41,7,42,29],[38,24,39,24],[38,25,39,25],[38,26,39,26],[38,27,39,27],[38,28,39,28],[38,0,39,6],[38,7,39,12],[38,13,39,21],[38,22,39,22],[38,23,39,23],[2,15,2,29],[27,0,27,29],[29,0,29,11],[33,16,33,29],[29,14,29,29],[36,29,37,29],[38,29,39,29],[13,12,14,17]]}
[null,null,null,null,null,null,null,null,null,null,null,null,null,null,null,null,null,null,null,null,null,null,null,null,null,null,null,"佐賀県"]
[]
["様式2-1 （「様式2-2」は、紙申請用であり、どちらか一方を提出）",null,null,null,null,null,null,null,null,null,null,null,null,null,null,"オンライン請求システム・WEB受付申請システム・電子媒体(CD-R）申請用"]
["事業実施計画書_医療機関・薬局等における感染拡大防止等支援事業"]
[]
["申請日",null,null,null,null,null,null,"（入力形式）　西暦４桁 / 月 / 日　　半角、スラッシュ区切り\n（表示は、元号表示になります）"]
[]
["施設概要"]
[]
[null,null,"助産所コードを有さない助産所は「9999999999」を入力してください"]
["医療機関等\nコード（10桁）",null,null,null,null,null,null,null,null,null,null,null,null,"施設名称",null,null,{"$f":"IF(D11&E11&F11&G11&H11&I11&J11&K11&L11&M11=\"\",\"医療機関コード、１０桁を入力すると、自動表示されます。\",\nIFERROR(VLOOKUP(D11&E11&F11&G11&H11&I11&J11&K11&L11&M11,医療機関コードマスタ!A:Z,2,0),\"自動表示されない場合は、番号をご確認下さい。　それでも\"&CHAR(10)&\"自動表示されない（または変更がある）場合は、手入力してください。\"))","v":"医療機関コード、１０桁を入力すると、自動表示されます。"}]
[]
[]
["管理者職名",null,null,null,null,null,null,null,null,"管理者氏名"]
[]
[]
["連絡先",null,null,"担当部署",null,null,null,null,"担当者氏名",null,null,null,null,"連絡先電話番号",null,null,null,null,"連絡先メールアドレス"]
[]
[]
["所在地",null,null,"郵便番号",null,null,null,null,null,null,null,"都道府県",null,null,null,"市区町村以降"]
[null,null,null,{"$f":"IFERROR(MID(VLOOKUP(D11&E11&F11&G11&H11&I11&J11&K11&L11&M11,医療機関コードマスタ!A:Z,3,0),1,1),\"\")","v":""},{"$f":"IFERROR(MID(VLOOKUP(D11&E11&F11&G11&H11&I11&J11&K11&L11&M11,医療機関コードマスタ!A:Z,3,0),2,1),\"\")","v":""},{"$f":"IFERROR(MID(VLOOKUP(D11&E11&F11&G11&H11&I11&J11&K11&L11&M11,医療機関コードマスタ!A:Z,3,0),3,1),\"\")","v":""},"-",{"$f":"IFERROR(MID(VLOOKUP(D11&E11&F11&G11&H11&I11&J11&K11&L11&M11,医療機関コードマスタ!A:Z,3,0),4,1),\"\")","v":""},{"$f":"IFERROR(MID(VLOOKUP(D11&E11&F11&G11&H11&I11&J11&K11&L11&M11,医療機関コードマスタ!A:Z,3,0),5,1),\"\")","v":""},{"$f":"IFERROR(MID(VLOOKUP(D11&E11&F11&G11&H11&I11&J11&K11&L11&M11,医療機関コードマスタ!A:Z,3,0),6,1),\"\")","v":""},{"$f":"IFERROR(MID(VLOOKUP(D11&E11&F11&G11&H11&I11&J11&K11&L11&M11,医療機関コードマスタ!A:Z,3,0),7,1),\"\")","v":""},{"$f":"IFERROR(VLOOKUP((D11&E11),リスト!B2:C48,2,0),\"\")","v":""},null,null,null,{"$f":"IFERROR(VLOOKUP(D11&E11&F11&G11&H11&I11&J11&K11&L11&M11,医療機関コードマスタ!A:Z,4,0),\"\")","v":""}]
[]
["施設類型（プルダウンから選択）",null,null,null,null,null,null,null,null,null,null,null,"許可病床数※\n（病院のみ記載）",null,null,null,null,null,null,"a_補助上限額（基準額）\n（円）",null,null,null,null,{"$f":"IF(COUNTIF(G23,\"病院*\")=1,200+5*P23,IF(OR(G23=\"有床診療所（医科）\",G23=\"有床診療所（歯科）\"),200,IF(OR(G23=\"無床診療所（医科）\",G23=\"無床診療所（歯科）\"),100,IF(OR(G23=\"薬局\",G23=\"訪問看護ステーション\",G23=\"助産所\"),70,\"０\"))))*10000","v":0}]
[null,null,null,null,null,null,{"$f":"IF(AND(OR(G23=\"病院（医科）\",G23=\"病院（歯科）\"),P23<20),\"病床数を入力して下さい。\",\"\")","v":""},null,null,null,null,null,"※ 原則として令和２年4月1日現在の医療法上の許可病床数"]
[]
["施設類型及び許可病床数に間違いがない",null,null,null,null,null,null,null,null,null,null,null,null,null,"施設類型及び許可病床数に間違いがない場合は、左の欄で「はい」を選択して下さい。\n※間違いがあり本来の補助金額を超過して補助金が支払われた場合、超過分は返還対象となります。"]
[]
["口座情報"]
[]
["国保連合会に登録されている口座は債権譲渡されていない\n（助産所コードを有さない助産所は、「いいえ」を選択してください）",null,null,null,null,null,null,null,null,null,null,null,"いいえ",null,"債権譲渡されていない場合は、「はい」を選択して下さい。債権譲渡されている場合は、国保連に登録されている口座への補助金の振込ができませんので、債権譲渡されていない口座の情報を提出していただく必要があります。"]
[]
["国保連合会による当該口座の債権譲渡に関する確認結果が都道府県に共有されることに同意する",null,null,null,null,null,null,null,null,null,null,null,null,null,null,null,"補助対象ではない債権譲渡先に補助金が渡ることを避けるため、国保連が保有している情報を用いて債権譲渡の有無に関して確認を行います。補助金交付過程において、その確認結果を都道府県に共有する必要があります。"]
[]
["国保連合会に登録されている口座情報を本事業の振込に使用することに同意する",null,null,null,null,null,null,null,null,null,null,null,null,null,null,null,"同意いただける場合は、「はい」を選択して下さい。"]
[]
["佐賀県が本事業の補助金を交付するために、提出される申請者情報・個人情報及び口座情報を委託業者及び指定金融機関に提供することに同意される場合は、口座情報をご記載下さい。"]
["金融機関名",null,null,null,null,null,null,null,null,null,"金融機関\nコード",null,null,null,null,null,null,"支店名",null,null,null,null,null,null,"支店コード"]
[]
["預金種類\n1：普通　2：当座　4：貯蓄",null,null,null,null,null,null,null,null,null,null,null,null,"口座番号（左詰め）"]
[]
["（フリガナ）"]
["取引口座名"]
[]
[]
["※なお、本事業実施のために新たに入手・共有された情報は本事業のみに用い、その他の目的で使用されることはありません。"]
[]
["新型コロナウイルス感染症を疑う患者受入れのための救急・周産期・小児医療体制確保事業との重複について"]
[]
["「新型コロナウイルス感染症を疑う患者受入れのための救急・周産期・小児医療体制確保事業」の支援金の申請をしておらず、申請する予定もない",null,null,null,null,null,null,null,null,null,null,null,null,null,null,null,null,null,null,null,null,null,"該当する場合は、「はい」を選択して下さい。\n※本事業と左記事業の補助は、重複して受けられませんので、\n　ご留意ください。"]
[]
[null,null,"事業費用"]
[]
[null,"【新型コロナウイルス感染症に対応した感染拡大防止対策や診療体制確保等に要する費用】"]
[]
[null,"対象期間（令和２年４月１日から令和３年３月31日）に、支出が予定されている各科目の費用について概算額を、ご記載ください。\n感染拡大防止対策に要する費用に限られず、院内等での感染拡大を防ぎながら地域で求められる医療を提供するための診療体制確保等に要する費用についても、幅広く補助の対象となります。\n※ 令和2年4月1日から令和3年3月31日までにかかる費用が対象となりますので、支出済みの費用だけでなく、申請日以降に発生が見込まれる費用も合わせて、概算額で申請してください。\nなお、後日に概算額で申請した場合、事後に実績報告が必要となるため、領収書等の証拠書類を保管しておいてください（実績報告の際に領収書等の証拠書類が必要となります）。なお、実績報告において対象とならない経費が含まれていた場合など、概算で交付した額が交付すべき確定額を上回るときは、その上回る額を返還していただくこととなります。"]
[]
[null,null,null,null,"科目",null,null,null,null,null,null,null,null,null,null,null,null,"支出予定額（円）",null,null,null,"収入予定額（円）"]
[null,null,null,null,"支出",null,"賃金・報酬"]
[null,null,null,null,null,null,"謝金"]
[null,null,null,null,null,null,"会議費"]
[null,null,null,null,null,null,"旅費"]
[null,null,null,null,null,null,"需用費"]
[null,null,null,null,null,null,"役務費"]
[null,null,null,null,null,null,"委託料"]
[null,null,null,null,null,null,"使用料及び賃借料"]
[null,null,null,null,null,null,"備品購入費"]
[null,null,null,null,null,null,"b_合計支出予定額（総事業費）",null,null,null,null,null,null,null,null,null,null,{"$f":"SUM(R58:U66)","v":0}]
[null,null,null,null,"収入",null,"ｃ_上記支出に対する本補助金以外の寄付金・その他の収入"]
[null,null,null,null,"d_合計支出予定額-収入予定額（円）（ｂ-ｃ）",null,null,null,null,null,null,null,null,null,null,null,null,{"$f":"R67-V68","v":0}]
[null,null,null,null,"補助金交付申請額（円）（aとdのいずれか少ない額)\n（1000円未満切捨）",null,null,null,null,null,null,null,null,null,null,null,null,{"$f":"ROUNDDOWN(IF(Y23<R69,Y23,R69),-3)","v":0}]
[]
[null,null,"上記、「賃金・報酬」に従前から勤務している者及び通常の医療の提供を行う者に係る人件費は含まれていない",null,null,null,null,null,null,null,null,null,null,null,null,null,null,null,"従前から勤務している者及び通常の医療の提供を行う者に係る人件費は、本事業の対象外ですので、ご確認ください。"]
[]
[null,"　対象期間に支出が予定されている各科目の費用について、概算でご記載ください。\n　各医療機関等からの申請は1回限りですので、対象となる可能性のある費用について、\n漏れのないようご留意ください。"]
[]
[]
[]
[]
[]
[]
[]
[]
[]
[]
[]
[]
[]
[]
[]
[]
[]
[]
[]
[]
[]
[]
[]
[]
[]
[]
[]
[]
[]
[]
[]
[]
[]
[]
["　　　　　　　ファイル　出力中"]
[]
["　　 　　　　　　　　　　しばらく、お待ちください"]

{"sheet":"申請概要","index":2,"n_rows":5,"n_cols":17,"rows_kept":5,"cut":false,"hidden":false,"merged":[[0,0,0,16],[0,22,0,28],[1,0,1,16],[3,1,3,10]]}
["様式3"]
["申請概要_医療機関・薬局等における感染拡大防止等支援事業"]
[]
["施設名称","医療機関等コード",null,null,null,null,null,null,null,null,null,"郵便番号","所在地","電話番号","補助金交付申請額(円)","【都道府県記載欄】\n補助金概算交付額(円)","事業計画書における\n国保連取扱\n不可事由"]
[{"$f":"IF(事業実施計画書!Q11=\"医療機関コード、１０桁を入力すると、自動表示されます。\",\"\",事業実施計画書!Q11)","v":""},{"$f":"IF(事業実施計画書!D11=\"\",\"\",事業実施計画書!D11)","v":""},{"$f":"IF(事業実施計画書!E11=\"\",\"\",事業実施計画書!E11)","v":""},{"$f":"IF(事業実施計画書!F11=\"\",\"\",事業実施計画書!F11)","v":""},{"$f":"IF(事業実施計画書!G11=\"\",\"\",事業実施計画書!G11)","v":""},{"$f":"IF(事業実施計画書!H11=\"\",\"\",事業実施計画書!H11)","v":""},{"$f":"IF(事業実施計画書!I11=\"\",\"\",事業実施計画書!I11)","v":""},{"$f":"IF(事業実施計画書!J11=\"\",\"\",事業実施計画書!J11)","v":""},{"$f":"IF(事業実施計画書!K11=\"\",\"\",事業実施計画書!K11)","v":""},{"$f":"IF(事業実施計画書!L11=\"\",\"\",事業実施計画書!L11)","v":""},{"$f":"IF(事業実施計画書!M11=\"\",\"\",事業実施計画書!M11)","v":""},{"$f":"事業実施計画書!D21&事業実施計画書!E21&事業実施計画書!F21&事業実施計画書!G21&事業実施計画書!H21&事業実施計画書!I21&事業実施計画書!J21&事業実施計画書!K21","v":"-"},{"$f":"事業実施計画書!L21&事業実施計画書!P21","v":""},{"$f":"IF(事業実施計画書!N18=\"\",\"\",事業実施計画書!N18)","v":""},{"$f":"事業実施計画書!R70","v":0},{"$f":"O5","v":0},{"$f":"IF(事業実施計画書!D10=9,\"有\",IF(AND(事業実施計画書!M30=\"はい\",事業実施計画書!O32=\"はい\",事業実施計画書!O34=\"はい\"),\"無\",\"有\"))","v":"有"}]

{"sheet":"リスト","index":3,"n_rows":48,"n_cols":3,"rows_kept":48,"cut":false,"hidden":true,"merged":[]}
[null,"コード","都道府県"]
[null,"01","北海道"]
[null,"02","青森県"]
[null,"03","岩手県"]
[null,"04","宮城県"]
[null,"05","秋田県"]
[null,"06","山形県"]
[null,"07","福島県"]
[null,"08","茨城県"]
[null,"09","栃木県"]
[null,"10","群馬県"]
[null,"11","埼玉県"]
[null,"12","千葉県"]
[null,"13","東京都"]
[null,"14","神奈川県"]
[null,"15","新潟県"]
[null,"16","富山県"]
[null,"17","石川県"]
[null,"18","福井県"]
[null,"19","山梨県"]
[null,"20","長野県"]
[null,"21","岐阜県"]
[null,"22","静岡県"]
[null,"23","愛知県"]
[null,"24","三重県"]
[null,"25","滋賀県"]
[null,"26","京都府"]
[null,"27","大阪府"]
[null,"28","兵庫県"]
[null,"29","奈良県"]
[null,"30","和歌山県"]
[null,"31","鳥取県"]
[null,"32","島根県"]
[null,"33","岡山県"]
[null,"34","広島県"]
[null,"35","山口県"]
[null,"36","徳島県"]
[null,"37","香川県"]
[null,"38","愛媛県"]
[null,"39","高知県"]
[null,"40","福岡県"]
[null,"41","佐賀県"]
[null,"42","長崎県"]
[null,"43","熊本県"]
[null,"44","大分県"]
[null,"45","宮崎県"]
[null,"46","鹿児島県"]
[null,"47","沖縄県"]

{"sheet":"医療機関コードマスタ","index":4,"n_rows":1723,"n_cols":4,"rows_kept":1723,"cut":false,"hidden":true,"merged":[]}
["医療機関\nコード","事業所名","郵便番号","住所"]
["4110111079","医療法人社団　真仁会　境野病院","8400831","佐賀市松原４丁目３番３号"]
["4110111103","神野病院","8400806","佐賀市神園３丁目１８番４５号"]
["4110111392","医療法人　諸隈病院","8400054","佐賀市水ケ江２丁目６番２２号"]
["4110111764","佐賀整肢学園　こども発達医療センター","8490906","佐賀市金立町大字金立２２１５番地２７"]
["4110112325","森永医院","8490901","佐賀市久保泉町大字川久保８７５番地"]
["4110112754","凌皮膚科医院","8400831","佐賀市松原３丁目４番３号"]
["4110113067","医療法人　聖医会　藤川病院","8400831","佐賀市松原一丁目２番６号"]
["4110113562","陣内胃腸科内科医院","8400859","佐賀市新栄西２丁目１番２号"]
["4110113885","杉原医院","8490932","佐賀市鍋島町大字八戸溝１６２９番地１"]
["4110114016","木村医院","8490903","佐賀市久保泉町大字下和泉１９３１番地"]
["4110114289","医療法人社団　恵風会　西村医院","8490912","佐賀市兵庫町大字瓦町９７１番地"]
["4110114297","清友病院","8490901","佐賀市久保泉町大字川久保５４５７番地"]
["4110114305","野口クリニック","8400801","佐賀市駅前中央２丁目１番１号"]
["4110114404","医療法人　加藤眼科医院","8490926","佐賀市若宮２丁目１７番２号"]
["4110114438","医療法人　信愛整形外科医院","8400843","佐賀市川原町４番８号"]
["4110114446","ながえ内科クリニック","8490934","佐賀市開成１丁目４番２号"]
["4110114453","医療法人　中央クリニック","8400834","佐賀市八幡小路５番１５号"]
["4110114479","前山医院","8400843","佐賀市川原町５番１７号"]
["4110114503","高柳内科・整形外科","8400863","佐賀市嘉瀬町大字十五２２９１番地１"]
["4110114511","医療法人　三和会　本多整形外科","8490922","佐賀市高木瀬東２丁目４番１０号"]
["4110114529","山口クリニック","8490937","佐賀市鍋島４丁目１番８号"]
["4110114545","佐賀県医療生活協同組合　神野診療所","8400804","佐賀市神野東四丁目１０番５号"]
["4110114552","医療法人　北島整形外科","8490922","佐賀市高木瀬東２丁目１５番６号"]
["4110114586","栗山医院","8400826","佐賀市白山１丁目４番６号"]
["4110114594","田尻医院","8400822","佐賀市高木町５番１６号"]
["4110114636","オガワ耳鼻咽喉科医院","8400805","佐賀市神野西３丁目１１番１号"]
["4110114651","医療法人　おそえがわ脳神経内科","8400806","佐賀市神園３丁目４番５号"]
["4110114669","医療法人　牧野医院","8490923","佐賀市日の出１丁目１４番２６号"]
["4110114776","医療法人　たじり内科・小児科","8490905","佐賀市金立町大字千布２１４５番地１"]
["4110114792","島田医院","8400861","佐賀市嘉瀬町大字中原１９７３番地１"]
["4110114800","ひさのう循環器・内科","8490937","佐賀市鍋島１丁目５番１号"]
["4110114842","くすの木耳鼻咽喉科クリニック","8490937","佐賀市鍋島三丁目６番２４号"]
["4110114875","医療法人　中原眼科医院","8400016","佐賀市南佐賀２丁目１４番１０号"]
["4110114925","医療法人　春陽会　上村病院","8490913","佐賀市兵庫町大字渕１９０３番地１"]
["4110114966","医療法人　力武医院","8400804","佐賀市神野東２丁目４番２２号"]
["4110115013","遠藤内科","8400027","佐賀市本庄町大字本庄５３９番地１"]
["4110115021","福岡病院","8490934","佐賀市開成６丁目１４番１０号"]
["4110115047","医療法人　むつみのかい　もろくま心療クリニック","8490921","佐賀市高木瀬西２丁目１７番２号"]
["4110115062","医療法人　平林胃腸科外科","8400031","佐賀市下田町２番２３号"]
["4110115070","医療法人　力武クリニック","8490934","佐賀市開成３丁目５番５号"]
["4110115104","医療法人　尽心会　百武整形外科病院","8400054","佐賀市水ケ江３丁目２番１３号"]
["4110115146","日浦呼吸器科内科小児科医院","8490937","佐賀市鍋島２丁目１２番３１号"]
["4110115161","小田クリニック","8400045","佐賀市西田代２丁目２番１７号"]
["4110115179","医療法人　同愛会　副島病院","8400811","佐賀市大財１丁目６番６０号"]
["4110115187","医療法人　浜崎整形外科","8400804","佐賀市神野東４丁目１２番８号"]
["4110115229","深川胃腸科外科医院","8400054","佐賀市水ケ江３丁目３番４号"]
["4110115237","森医院","8400854","佐賀市八戸２丁目１番１３号"]
["4110115286","ナガセ皮ふ科泌尿器科クリニック","8400806","佐賀市神園四丁目７番１４号"]
["4110115302","橋野医院","8490922","佐賀市高木瀬東五丁目１７番１５号"]
["4110115310","医療法人　双水会　熊谷整形外科","8400023","佐賀市本庄町大字袋２７５番地１"]
["4110115344","医療法人　智仁会　佐賀リハビリテーション病院","8400016","佐賀市南佐賀１丁目１７番１号"]
["4110115385","医療法人　仁和会　小池病院","8400861","佐賀市嘉瀬町大字中原１９２２番地２"]
["4110115401","こうの医院","8490918","佐賀市兵庫南一丁目１２番７号"]
["4110115427","しらみず診療所","8400801","佐賀市駅前中央二丁目７番１９号"]
["4110115435","黒沢内科医院","8400012","佐賀市北川副町大字光法１５９７番地"]
["4110115484","医療法人　田中産婦人科","8490918","佐賀市兵庫南一丁目１９番４２号"]
["4110115534","さとう泌尿器科","8490937","佐賀市鍋島２丁目６番２７号"]
["4110115567","医療法人　北野整形外科医院","8490928","佐賀市若楠二丁目４番１０号"]
["4110115591","医療法人　ばばこどもクリニック","8490937","佐賀市鍋島３丁目１５番２６号"]
["4110115617","横尾クリニック","8400853","佐賀市長瀬町７番２３号ー１"]
["4110115625","医療法人　千葉内科循環器科","8400815","佐賀市天神二丁目３番３８号"]
["4110115674","内野産婦人科","8400054","佐賀市水ケ江２丁目４番２号"]
["4110115716","ごとう整形外科皮ふ科クリニック","8400015","佐賀市木原２丁目１７番９号"]
["4110115724","松永内科医院","8490921","佐賀市高木瀬西１丁目３番２５号"]
["4110115732","医療法人　安寿会　田中病院","8400862","佐賀市嘉瀬町大字扇町２３４４番地１６"]
["4110115740","医療法人　徹心会　こうの眼科クリニック","8400801","佐賀市駅前中央一丁目５番１０号"]
["4110115757","かじはら内科クリニック","8490935","佐賀市八戸溝二丁目１０番２号"]
["4110115773","さくらクリニック","8490937","佐賀市鍋島２丁目２番１２号"]
["4110115799","島田病院","8400861","佐賀市嘉瀬町大字中原１６７９番地１"]
["4110115815","医療法人　吉松皮フ科","8400027","佐賀市本庄町大字本庄８８８番地５"]
["4110115856","つのだ内科クリニック","8490918","佐賀市兵庫南２丁目１６番３２号"]
["4110115872","医療法人社団　敬愛会　佐賀記念病院","8490917","佐賀市高木瀬町大字長瀬１２４０番地１"]
["4110115880","ＳＡＧＡ　なんでも相談クリニック","8408580","佐賀市中の小路２番５号"]
["4110115948","医療法人　龍皮フ科クリニック","8490918","佐賀市兵庫南三丁目１番１号"]
["4110115971","たんぽぽクリニック","8490926","佐賀市若宮一丁目１９番２９号"]
["4110115989","陣内内科・小児科クリニック","8490926","佐賀市若宮３丁目５番１７号"]
["4110115997","神田胃腸科内科医院","8400005","佐賀市蓮池町大字蓮池３６５番地７"]
["4110116011","あさりメンタルクリニック","8400054","佐賀市水ケ江一丁目１番７号"]
["4110116029","佐賀クリニック","8400825","佐賀市中央本町２番２１号"]
["4110116037","矢ヶ部医院","8400015","佐賀市木原三丁目２番１１号"]
["4110116045","医療法人　金武外科肛門科","8400041","佐賀市城内二丁目２番５６号"]
["4110116078","服巻胃腸科内科","8400833","佐賀市中の小路９番１８号"]
["4110116094","医療法人　三和会　兵庫整形外科","8400001","佐賀市巨勢町大字修理田１２２６番地３"]
["4110116102","医療法人　南里泌尿器科医院","8400831","佐賀市松原三丁目２番３３号"]
["4110116110","やまだ耳鼻咽喉科","8490922","佐賀市高木瀬東三丁目４０９番地１"]
["4110116128","医療法人　多布施クリニック","8400842","佐賀市多布施４丁目１番６号"]
["4110116144","西山クリニック","8400821","佐賀市東佐賀町１４番２６号"]
["4110116151","医療法人　しまだ眼科","8400862","佐賀市嘉瀬町大字扇町２４７７番地１"]
["4110116169","医療法人　新栄こどもクリニック","8400857","佐賀市鍋島町八戸１３４３番地７"]
["4110116177","筒井クリニック","8400805","佐賀市神野西４丁目１２番３５号"]
["4110116185","前山皮膚科","8400804","佐賀市神野東３丁目７番１号"]
["4110116193","医療法人　卓悠会　さが駅前眼科","8400804","佐賀市神野東１丁目９番１８号"]
["4110116201","医療法人　笙船会　飯盛内科","8400842","佐賀市多布施２丁目６番２４号"]
["4110116227","医療法人　草場整形外科","8400042","佐賀市赤松町１番９号"]
["4110116235","江口医院","8400804","佐賀市神野東１丁目５番１号"]
["4110116243","医療法人　西島皮膚科医院","8400201","佐賀市大和町大字尼寺２６７１番地２"]
["4110116250","なかしま小児科","8490912","佐賀市兵庫町大字瓦町１０９６番２"]
["4110116284","医療法人　森永整形外科医院","8490934","佐賀市開成六丁目１４番４８号"]
["4110116318","神代整形外科","8400214","佐賀市大和町大字川上１７０番地４"]
["4110116342","橋野こどもクリニック","8490922","佐賀市高木瀬東四丁目１４番３号"]
["4110116359","内藤医院　北山診療所","8400532","佐賀市富士町大字大野１０６０番地２３"]
["4110116367","中尾整形外科","8490913","佐賀市兵庫町大字渕１３３５番地１"]
["4110116375","医療法人　永浜眼科医院","8400825","佐賀市中央本町３番８号"]
["4110116409","おおくま産婦人科","8490921","佐賀市高木瀬西二丁目１０番５号"]
["4110116417","医療法人　明雄会　深町眼科医院","8400047","佐賀市与賀町２番６９号"]
["4110116433","悠心堂クリニック","8400826","佐賀市白山二丁目７番１号エスプラッツ２階"]
["4110116441","中山内科クリニック","8490921","佐賀市高木瀬西４丁目６番１４号"]
["4110116466","ライフスタイル医科学研究所内診療所","8400815","佐賀市天神２丁目５番２５号２Ｆ"]
["4110116474","医療法人　ながせ皮膚科","8490921","佐賀市高木瀬西５丁目１５番２７号"]
["4110116516","和水心療クリニック","8400201","佐賀市大和町大字尼寺３１２７番地１"]
["4110116524","くさば耳鼻咽喉科クリニック","8402213","佐賀市川副町鹿江１００５番地５"]
["4110116557","夢咲胃腸内科","8490919","佐賀市兵庫北２丁目３０番２３号"]
["4110116607","美川眼科医院","8400831","佐賀市松原４丁目３番２１号"]
["4110116631","えがしら小児科医院","8490919","佐賀市兵庫北２丁目２５番４８号"]
["4110116664","ゆめ眼科医院","8490919","佐賀市兵庫北５丁目１４番１号ゆめタウン佐賀２階"]
["4110116672","森　医院","8400812","佐賀市愛敬町８番１１号"]
["4110116698","医療法人　えとう内科・循環器内科","8400804","佐賀市神野東四丁目３番１９号"]
["4110116706","統合医療　やまのうち小児科・内科","8490919","佐賀市兵庫北５丁目８－７－２"]
["4110116714","岸川整形外科","8400027","佐賀市本庄町本庄８６２番地１"]
["4110116730","医療法人　九曜会　こが内科こどもクリニック","8400034","佐賀市西与賀町大字厘外８５９番地１５"]
["4110116748","庄野真由美レディースクリニック","8490919","佐賀市兵庫北二丁目３０番２６号"]
["4110116755","医療法人　ひさとみ内科クリニック","8490937","佐賀市鍋島三丁目６番１３号"]
["4110116763","じんの内医院","8400017","佐賀市新郷本町２４番３号"]
["4110116789","医療法人　中尾医院","8400825","佐賀市中央本町１－２２"]
["4110116797","医療法人　みぞかみ耳鼻咽喉科","8400047","佐賀市与賀町４番２１号"]
["4110116805","ももた耳鼻咽喉科","8490919","佐賀市兵庫北２丁目３１番２６号"]
["4110116813","あじさいクリニック乳腺外科","8400801","佐賀市駅前中央１－９－３８ＳＯＮＩＣ佐賀駅前ビル１階"]
["4110116821","第一心療クリニック","8400816","佐賀市駅南本町６－４　第一生命ビル４階"]
["4110116847","医療法人　清藍会　丸内クリニック","8490918","佐賀市兵庫南二丁目１８番２８号"]
["4110116854","しげた総合診療クリニック","8400214","佐賀市大和町大字川上３２３－１"]
["4110116870","内田クリニック","8490916","佐賀市高木瀬町大字東高木２４１番地２"]
["4110116888","乘富医院","8400853","佐賀市長瀬町３番１５号"]
["4110116896","佐藤整形外科","8400811","佐賀市大財三丁目５番１８号"]
["4110116904","木下医院","8490902","佐賀市久保泉町上和泉２２３２番地１"]
["4110116912","医療法人かたえ内科・呼吸器クリニック","8490917","佐賀市高木瀬町長瀬１２４５番地３"]
["4110116920","医療法人　さの眼科","8490919","佐賀市兵庫北二丁目２５番８号"]
["4110116938","ささきこどもクリニック","8400201","佐賀市大和町尼寺３４２４番地６"]
["4110116946","若楠クリニック","8400801","佐賀市駅前中央１－１０－３７佐賀駅前センタービル６Ｆ"]
["4110116953","医療法人　夢咲クリニック","8490919","佐賀市兵庫北一丁目８番２３号"]
["4110116987","かみぞのクリニック","8400806","佐賀市神園六丁目４番１６号"]
["4110117001","やさか内科皮膚科","8400015","佐賀市木原一丁目２４番３８号"]
["4110117019","こやなぎ内科クリニック","8490917","佐賀市高木瀬町大字長瀬９６９番地１アルタ高木瀬店２階"]
["4110117035","いちはら耳鼻咽喉科クリニック","8400862","佐賀市嘉瀬町大字扇町２４６９－２６"]
["4110117043","萩原脳神経外科クリニック","8400015","佐賀市木原一丁目２４番３８号"]
["4110117050","さやのもとクリニック","8400044","佐賀市道祖元町７１番"]
["4110117084","医療法人　尽心会　百武整形外科・スポーツクリニック","8400054","佐賀市水ケ江４丁目２番１５号"]
["4110117092","わたなべ女性内科","8490936","佐賀市鍋島町大字森田５９４－１"]
["4110117118","植田産婦人科内科医院","8400047","佐賀市与賀町２番５３号"]
["4110117142","こいけクリニック","8490919","佐賀市兵庫北２丁目１９番１２号"]
["4110117167","一般財団法人佐賀県産業医学協会","8400857","佐賀市鍋島町八戸１９９４番地１"]
["4110117183","なゆたの森病院","8400027","佐賀市本庄町大字本庄２６９番地１"]
["4110117209","医療法人社団敬愛会　健診センター佐賀","8490917","佐賀市高木瀬町大字長瀬１１６７番地２"]
["4110117217","さがセレニティクリニック","8490937","佐賀市鍋島３－２－４－１Ｆ"]
["4110117258","晴寿診療所","8490916","佐賀市高木瀬町東高木１１７０"]
["4110117282","寺田内科","8400811","佐賀市大財１丁目８番３０号"]
["4110117290","満岡内科クリニック","8400201","佐賀市大和町大字尼寺８４８番地１１"]
["4110117316","二宮内科医院","8490918","佐賀市兵庫南２丁目１４番１９号"]
["4110117324","古賀クリニック","8400054","佐賀市水ヶ江１丁目３番１３－２号"]
["4110117332","医療法人　森山胃腸科","8402101","佐賀市諸富町大字大堂９３７番地１"]
["4110117340","しまのえ耳鼻咽喉科","8400804","佐賀市神野東４丁目３－２９"]
["4110117357","産婦人科　なかなみクリニック","8400015","佐賀市木原１丁目２４番３８号"]
["4110117365","コールメディカルクリニック佐賀","8490937","佐賀市鍋島４丁目１番２３号"]
["4110117381","佐賀県健康づくり財団　佐賀県健診・検査センター","8400054","佐賀市水ケ江一丁目１２番１０号"]
["4110117399","中原胃腸科内科","8400041","佐賀市城内一丁目５番９号"]
["4110117407","鶴田内科","8490923","佐賀市日の出一丁目１４番１３号"]
["4110117415","富﨑小児科","8400804","佐賀市神野東２丁目４－３８"]
["4110117423","山口耳鼻咽喉科医院","8400832","佐賀市堀川町１－８"]
["4110117431","池田内科・消化器科","8490926","佐賀市若宮３－１－２４"]
["4110117456","みね内科循環器科クリニック","8490916","佐賀市高木瀬町大字東高木２３１－１２"]
["4110117464","さが恵比須メンタルくりにっく","8490936","佐賀市鍋島町大字森田１１４８番地"]
["4110117472","さかえまち整形外科","8400803","佐賀市栄町２番８号"]
["4110117480","小林耳鼻咽喉科クリニック","8400833","佐賀市中の小路７番３０号"]
["4110117498","山口眼科医院","8400831","佐賀市松原２丁目１１番２０号"]
["4110117506","すこやか女性クリニック","8400826","佐賀市白山二丁目７番１号　エスプラッツ２階"]
["4110117514","いさがいこどもクリニック","8490036","佐賀市西与賀町大字高太郎字高太郎五１２６番１５"]
["4110117522","医療法人　慶仁会　森川耳鼻咽喉科","8400027","佐賀市本庄町大字本庄１２６６番１"]
["4110117548","医療法人　正和会　志田内科","8400054","佐賀市水ケ江二丁目７番２３号"]
["4110117555","南かわそえクリニック","8402213","佐賀市川副町鹿江２２１番地５－１"]
["4110117563","正島脳神経外科","8490937","佐賀市鍋島一丁目３番１０号"]
["4110117571","福田脳神経外科病院","8400027","佐賀市本庄町本庄１２３６番地２"]
["4110117589","医療法人　秀裕会　池田内科皮膚科医院","8400862","佐賀市嘉瀬町大字扇町２３８３番地"]
["4110117597","おおたゆうこ小児科","8400015","佐賀市木原二丁目２３番１号"]
["4110117605","小野病院","8400008","佐賀市巨勢町大字牛島２４４番地７"]
["4110117613","ゆたか内科消化器科クリニック","8490918","佐賀市兵庫南一丁目２０番１５号"]
["4110117621","ぶどうの木クリニック","8400054","佐賀市水ケ江１丁目２－２１"]
["4110117639","まつした耳鼻咽喉科クリニック","8400012","佐賀市北川副町大字光法１４８４番地１"]
["4110117647","佐賀駅南クリニック","8400801","佐賀市駅前中央一丁目９番３８号ＳＯＮＩＣ佐賀駅前ビル６階"]
["4110117654","おおいし脳・神経リハクリニック","8490936","佐賀市鍋島町森田６０５番地５"]
["4110117662","こいけクリニック","8490919","佐賀市兵庫北２丁目１９番１２号"]
["4110117670","クリニック新生","8400856","佐賀市新生町５番１５号"]
["4110117688","とも眼科","8490918","佐賀市兵庫南１丁目２２番１１号"]
["4110117696","佐賀市医師会「発熱トリアージ」","8400054","佐賀市水ケ江１丁目１２番１１号"]
["4110123991","沖田眼科医院","8490922","佐賀市高木瀬東２丁目１５番２号"]
["4110124007","わたなべ小児科","8400806","佐賀市神園２丁目７番６号"]
["4110124783","武藤医院","8400016","佐賀市南佐賀二丁目１番１３号"]
["4110132220","佐賀整肢学園　こども発達医療センター","8490906","佐賀市金立町大字金立２２１５番地２７"]
["4110132774","医療法人社団　敬愛会　佐賀記念病院","8490917","佐賀市高木瀬町大字長瀬１２４０番地１"]
["4110132808","島田病院","8400861","佐賀市嘉瀬町大字中原１６７９番地１"]
["4110211697","丸田ひふ科","8470013","唐津市南城内３番３号"]
{"$rows_left_out":1523}